Reaction Details
TargetCoagulation factor X
LigandBDBM50228911
Substrate/Competitorn/a
Meas. Tech.ChEMBL_461701 (CHEMBL927722)
Ki 2.8±n/a nM
Citation Varnes, JGWacker, DAPinto, DJOrwat, MJTheroff, JPWells, BGalemo, RALuettgen, JMKnabb, RMBai, SHe, KLam, PYWexler, RR Structure-activity relationship and pharmacokinetic profile of 5-ketopyrazole factor Xa inhibitors. Bioorg Med Chem Lett18:749-54 (2008) 
 
Coagulation factor X
Name:Coagulation factor X
Type:Enzyme
Mol. Mass.:54726.60
Organism:Homo sapiens (Human)
Description:n/a
Residue:488
BDBM50228911
NameBDBM50228911
Synonyms:1-[2-(3-amino-benzo[d]isoxazol-5-yl)-5-trifluoromethyl-2H-pyrazol-3-yl]-2-(3-fluoro-2'-methanesulfonyl-biphenyl-4-yl)-propan-1-one | CHEMBL269191
TypeSmall organic molecule
Emp. Form.C27H20F4N4O4S
Mol. Mass.572.531
SMILESCC(C(=O)c1cc(nn1-c1ccc2onc(N)c2c1)C(F)(F)F)c1ccc(cc1F)-c1ccccc1S(C)(=O)=O