Reaction Details
TargetProthrombin
LigandBDBM50228914
Substrate/Competitorn/a
Meas. Tech.ChEMBL_461704 (CHEMBL927725)
Ki>15000±n/a nM
Citation Varnes, JGWacker, DAPinto, DJOrwat, MJTheroff, JPWells, BGalemo, RALuettgen, JMKnabb, RMBai, SHe, KLam, PYWexler, RR Structure-activity relationship and pharmacokinetic profile of 5-ketopyrazole factor Xa inhibitors. Bioorg Med Chem Lett18:749-54 (2008) 
 
Prothrombin
Name:Prothrombin
Type:Protein
Mol. Mass.:70029.57
Organism:Homo sapiens (Human)
Description:P00734
Residue:622
BDBM50228914
NameBDBM50228914
Synonyms:5-(2-(2-fluoro-4-(2-oxopyridin-1(2H)-yl)phenyl)acetyl)-1-(4-methoxyphenyl)-1H-pyrazole-3-carboxamide | CHEMBL403042
TypeSmall organic molecule
Emp. Form.C24H19FN4O4
Mol. Mass.446.4305
SMILESCOc1ccc(cc1)-n1nc(cc1C(=O)Cc1ccc(cc1F)-n1ccccc1=O)C(N)=O