Reaction Details
TargetCoagulation factor X
LigandBDBM50228917
Substrate/Competitorn/a
Meas. Tech.ChEMBL_461701 (CHEMBL927722)
Ki 0.57±n/a nM
Citation Varnes, JGWacker, DAPinto, DJOrwat, MJTheroff, JPWells, BGalemo, RALuettgen, JMKnabb, RMBai, SHe, KLam, PYWexler, RR Structure-activity relationship and pharmacokinetic profile of 5-ketopyrazole factor Xa inhibitors. Bioorg Med Chem Lett18:749-54 (2008) 
 
Coagulation factor X
Name:Coagulation factor X
Type:Enzyme
Mol. Mass.:54726.60
Organism:Homo sapiens (Human)
Description:n/a
Residue:488
BDBM50228917
NameBDBM50228917
Synonyms:1-[2-(3-amino-benzo[d]isoxazol-5-yl)-5-trifluoromethyl-2H-pyrazol-3-yl]-2-(2'-dimethylaminomethyl-3-fluoro-biphenyl-4-yl)-ethanone | CHEMBL253926
TypeSmall organic molecule
Emp. Form.C28H23F4N5O2
Mol. Mass.537.5081
SMILESCN(C)Cc1ccccc1-c1ccc(CC(=O)c2cc(nn2-c2ccc3onc(N)c3c2)C(F)(F)F)c(F)c1