Reaction Details
TargetPlasminogen
LigandBDBM12676
Substrate/Competitorn/a
Meas. Tech.ChEMBL_461716 (CHEMBL928847)
Ki>15000±n/a nM
Citation Varnes, JGWacker, DAPinto, DJOrwat, MJTheroff, JPWells, BGalemo, RALuettgen, JMKnabb, RMBai, SHe, KLam, PYWexler, RR Structure-activity relationship and pharmacokinetic profile of 5-ketopyrazole factor Xa inhibitors. Bioorg Med Chem Lett18:749-54 (2008) 
 
Plasminogen
Name:Plasminogen
Type:Enzyme
Mol. Mass.:90579.18
Organism:Homo sapiens (Human)
Description:n/a
Residue:810
BDBM12676
NameBDBM12676
Synonyms:1-(3-Aminobenzisoxazol-5-yl)-3-trifluoromethyl-N-[2-fluoro-4-[(2-dimethylaminomethyl)imidazol-1-yl]phenyl]-1H-pyrazole-5-carboxyamide Hydrochloride Salt BMS-561389 CHEMBL558198 Razaxaban
TypeSmall organic molecule
Emp. Form.C24H20F4N8O2
Mol. Mass.528.4616
SMILESCN(C)Cc1nccn1-c1ccc(NC(=O)c2cc(nn2-c2ccc3onc(N)c3c2)C(F)(F)F)c(F)c1