Reaction Details
TargetHistamine H3 receptor
LigandBDBM50371314
Substrate/Competitorn/a
Meas. Tech.ChEMBL_463175 (CHEMBL948189)
Ki 1±n/a nM
Citation Ly, KSLetavic, MAKeith, JMMiller, JMStocking, EMBarbier, AJBonaventure, PLord, BJiang, XBoggs, JDDvorak, LMiller, KLNepomuceno, DWilson, SJCarruthers, NI Synthesis and biological activity of piperazine and diazepane amides that are histamine H3 antagonists and serotonin reuptake inhibitors. Bioorg Med Chem Lett18:39-43 (2008) 
 
Histamine H3 receptor
Name:Histamine H3 receptor
Type:G Protein-Coupled Receptor (GPCR)
Mol. Mass.:48691.47
Organism:Homo sapiens (Human)
Description:Binding assays were using CHO cells stably expressing hH3R receptors.
Residue:445
BDBM50371314
NameBDBM50371314
Synonyms:CHEMBL402949
TypeSmall organic molecule
Emp. Form.C23H28FN3O2
Mol. Mass.397.4857
SMILESCNCc1cc(ccc1Oc1ccccc1F)C(=O)N1CCCN(CC1)C1CC1