Reaction Details
TargetP2Y purinoceptor 12
LigandBDBM50371579
Substrate/Competitorn/a
Meas. Tech.ChEMBL_463779 (CHEMBL931130)
IC50 237±n/a nM
Citation Douglass, JGPatel, RIYerxa, BRShaver, SRWatson, PSBednarski, KPlourde, RRedick, CCBrubaker, KJones, ACBoyer, JL Lipophilic modifications to dinucleoside polyphosphates and nucleotides that confer antagonist properties at the platelet P2Y12 receptor. J Med Chem51:1007-25 (2008) 
 
P2Y purinoceptor 12
Name:P2Y purinoceptor 12
Type:Enzyme
Mol. Mass.:39458.48
Organism:Homo sapiens (Human)
Description:Q9H244
Residue:342
BDBM50371579
NameBDBM50371579
Synonyms:CHEMBL1162171
TypeSmall organic molecule
Emp. Form.C26H33N6O8P
Mol. Mass.588.5494
SMILESCCCCCCNC(=O)Nc1ncnc2n(cnc12)[C@@H]1O[C@H](COP(O)(O)=O)[C@H]2OC(O[C@@H]12)\C=C\c1ccccc1