Reaction Details
Target5-hydroxytryptamine receptor 2A
LigandBDBM50371669
Substrate/Competitorn/a
Meas. Tech.ChEMBL_463838 (CHEMBL934032)
Ki 0.7±n/a nM
Citation Shireman, BTDvorak, CARudolph, DABonaventure, PNepomuceno, DDvorak, LMiller, KLLovenberg, TWCarruthers, NI 2-Alkyl-4-aryl-pyrimidine fused heterocycles as selective 5-HT2A antagonists. Bioorg Med Chem Lett18:2103-8 (2008) 
 
5-hydroxytryptamine receptor 2A
Name:5-hydroxytryptamine receptor 2A
Type:undefined
Mol. Mass.:52607.65
Organism:Homo sapiens (Human)
Description:P28223
Residue:471
BDBM50371669
NameBDBM50371669
Synonyms:CHEMBL402164
TypeSmall organic molecule
Emp. Form.C21H19F2N3
Mol. Mass.351.3925
SMILESFc1ccc(Cc2nc3CCNCCc3c(n2)-c2ccc(F)cc2)cc1