Reaction Details
TargetGag-Pro polyprotein
LigandBDBM50371705
Substrate/Competitorn/a
Meas. Tech.ChEMBL_463999 (CHEMBL929986)
IC50 140±n/a nM
Citation Nguyen, JTZhang, MKumada, HOItami, ANishiyama, KKimura, TCheng, MHayashi, YKiso, Y Truncation and non-natural amino acid substitution studies on HTLV-I protease hexapeptidic inhibitors. Bioorg Med Chem Lett18:366-70 (2008) 
 
Gag-Pro polyprotein
Name:Gag-Pro polyprotein
Type:PROTEIN
Mol. Mass.:71577.03
Organism:Human T-cell leukemia virus 1 (strain Japan ATK-1 subtype A) (HTLV-1)
Description:ChEMBL_303297
Residue:651
BDBM50371705
NameBDBM50371705
Synonyms:CHEMBL401718 | KNI-10455
TypeSmall organic molecule
Emp. Form.C36H49N5O6S
Mol. Mass.679.869
SMILESCC(=C)CNC(=O)C1N(CSC1(C)C)C(=O)[C@@H](O)[C@H](Cc1ccccc1)NC(=O)[C@@H](NC(=O)[C@@H](NC(C)=O)c1ccccc1)C(C)(C)C