Reaction Details
TargetGag-Pro polyprotein
LigandBDBM50371707
Substrate/Competitorn/a
Meas. Tech.ChEMBL_463999 (CHEMBL929986)
IC50 84±n/a nM
Citation Nguyen, JTZhang, MKumada, HOItami, ANishiyama, KKimura, TCheng, MHayashi, YKiso, Y Truncation and non-natural amino acid substitution studies on HTLV-I protease hexapeptidic inhibitors. Bioorg Med Chem Lett18:366-70 (2008) 
 
Gag-Pro polyprotein
Name:Gag-Pro polyprotein
Type:PROTEIN
Mol. Mass.:71577.03
Organism:Human T-cell leukemia virus 1 (strain Japan ATK-1 subtype A) (HTLV-1)
Description:ChEMBL_303297
Residue:651
BDBM50371707
NameBDBM50371707
Synonyms:CHEMBL272710 | KNI-10221
TypeSmall organic molecule
Emp. Form.C43H62N8O9S
Mol. Mass.867.066
SMILESCC[C@H](C)[C@H](NC(=O)[C@@H]1N(CSC1(C)C)C(=O)[C@@H](O)[C@H](Cc1ccccc1)NC(=O)[C@@H](NC(=O)[C@@H](NC(C)=O)c1ccccc1)C(C)(C)C)C(=O)N[C@@H](CCC(N)=O)C(N)=O