Reaction Details
TargetGag-Pro polyprotein
LigandBDBM50242888
Substrate/Competitorn/a
Meas. Tech.ChEMBL_463999 (CHEMBL929986)
IC50 107±n/a nM
Citation Nguyen, JTZhang, MKumada, HOItami, ANishiyama, KKimura, TCheng, MHayashi, YKiso, Y Truncation and non-natural amino acid substitution studies on HTLV-I protease hexapeptidic inhibitors. Bioorg Med Chem Lett18:366-70 (2008) 
 
Gag-Pro polyprotein
Name:Gag-Pro polyprotein
Type:PROTEIN
Mol. Mass.:71577.03
Organism:Human T-cell leukemia virus 1 (strain Japan ATK-1 subtype A) (HTLV-1)
Description:ChEMBL_303297
Residue:651
BDBM50242888
NameBDBM50242888
Synonyms:(R)-3-((2S,3S)-3-((S)-2-((S)-2-acetamido-2-phenylacetamido)-3,3-dimethylbutanamido)-2-hydroxy-4-phenylbutanoyl)-N-isobutyl-5,5-dimethylthiazolidine-4-carboxamide CHEMBL446908 | KNI-10516
TypeSmall organic molecule
Emp. Form.C36H51N5O6S
Mol. Mass.681.885
SMILESCC(C)CNC(=O)[C@H]1N(CSC1(C)C)C(=O)[C@@H](O)[C@H](Cc1ccccc1)NC(=O)[C@@H](NC(=O)[C@@H](NC(C)=O)c1ccccc1)C(C)(C)C