Reaction Details
TargetGag-Pro polyprotein
LigandBDBM50371713
Substrate/Competitorn/a
Meas. Tech.ChEMBL_463999 (CHEMBL929986)
IC50 146±n/a nM
Citation Nguyen, JTZhang, MKumada, HOItami, ANishiyama, KKimura, TCheng, MHayashi, YKiso, Y Truncation and non-natural amino acid substitution studies on HTLV-I protease hexapeptidic inhibitors. Bioorg Med Chem Lett18:366-70 (2008) 
 
Gag-Pro polyprotein
Name:Gag-Pro polyprotein
Type:PROTEIN
Mol. Mass.:71577.03
Organism:Human T-cell leukemia virus 1 (strain Japan ATK-1 subtype A) (HTLV-1)
Description:ChEMBL_303297
Residue:651
BDBM50371713
NameBDBM50371713
Synonyms:CHEMBL271454 | KNI-10592
TypeSmall organic molecule
Emp. Form.C36H49N5O6S
Mol. Mass.679.869
SMILESCC(=O)N[C@H](C(=O)N[C@H](C(=O)N[C@@H](Cc1ccccc1)[C@H](O)C(=O)N1CSC(C)(C)C1C(=O)NCC1CC1)C(C)(C)C)c1ccccc1