Reaction Details
TargetGag-Pro polyprotein
LigandBDBM50371720
Substrate/Competitorn/a
Meas. Tech.ChEMBL_463999 (CHEMBL929986)
IC50 95±n/a nM
Citation Nguyen, JTZhang, MKumada, HOItami, ANishiyama, KKimura, TCheng, MHayashi, YKiso, Y Truncation and non-natural amino acid substitution studies on HTLV-I protease hexapeptidic inhibitors. Bioorg Med Chem Lett18:366-70 (2008) 
 
Gag-Pro polyprotein
Name:Gag-Pro polyprotein
Type:PROTEIN
Mol. Mass.:71577.03
Organism:Human T-cell leukemia virus 1 (strain Japan ATK-1 subtype A) (HTLV-1)
Description:ChEMBL_303297
Residue:651
BDBM50371720
NameBDBM50371720
Synonyms:CHEMBL272280 | KNI-10192
TypeSmall organic molecule
Emp. Form.C45H67N7O8S
Mol. Mass.866.121
SMILESCC[C@H](C)[C@H](NC(C)=O)C(=O)N[C@@H]([C@@H](C)CC)C(=O)N[C@@H](Cc1ccccc1)[C@H](O)C(=O)N1CSC(C)(C)[C@@H]1C(=O)N[C@@H]([C@@H](C)CC)C(=O)N[C@@H](Cc1ccccc1)C(N)=O