Reaction Details
TargetMelanin-concentrating hormone receptor 1
LigandBDBM50371870
Substrate/Competitorn/a
Meas. Tech.ChEMBL_464118 (CHEMBL948281)
Ki 31±n/a nM
Citation Erickson, SDBanner, BBerthel, SConde-Knape, KFalcioni, FHakimi, IHennessy, BKester, RFKim, KMa, CMcComas, WMennona, FMischke, SOrzechowski, LQian, YSalari, HTengi, JThakkar, KTaub, RTilley, JWWang, H Potent, selective MCH-1 receptor antagonists. Bioorg Med Chem Lett18:1402-6 (2008) 
 
Melanin-concentrating hormone receptor 1
Name:Melanin-concentrating hormone receptor 1
Type:G Protein-Coupled Receptor (GPCR)
Mol. Mass.:45976.27
Organism:Homo sapiens (Human)
Description:Membranes from CHO-K1 cells stably expressing human MCH1R were used in assays.
Residue:422
BDBM50371870
NameBDBM50371870
Synonyms:CHEMBL258260
TypeSmall organic molecule
Emp. Form.C29H38N4O2
Mol. Mass.474.6376
SMILESCO[C@@H]1CN(C[C@@H]2Cc3ccc(NC(=O)C(C)C)cc3C2)CC[C@H]1n1c(C)nc2cc(C)ccc12