Reaction Details
TargetCytochrome P450 1A2
LigandBDBM50184807
Substrate/Competitorn/a
Meas. Tech.ChEMBL_464238 (CHEMBL935250)
IC50>40000±n/a nM
Citation Cai, ZWZhang, YBorzilleri, RMQian, LBarbosa, SWei, DZheng, XWu, LFan, JShi, ZWautlet, BSMortillo, SJeyaseelan, RKukral, DWKamath, AMarathe, PD'Arienzo, CDerbin, GBarrish, JCRobl, JAHunt, JTLombardo, LJFargnoli, JBhide, RS Discovery of brivanib alaninate ((S)-((R)-1-(4-(4-fluoro-2-methyl-1H-indol-5-yloxy)-5-methylpyrrolo[2,1-f][1,2,4]triazin-6-yloxy)propan-2-yl)2-aminopropanoate), a novel prodrug of dual vascular endothelial growth factor receptor-2 and fibroblast growth factor receptor-1 kinase inhibitor (BMS-540215 J Med Chem51:1976-80 (2008) 
 
Cytochrome P450 1A2
Name:Cytochrome P450 1A2
Type:Enzyme
Mol. Mass.:58423.38
Organism:Homo sapiens (Human)
Description:P05177
Residue:516
BDBM50184807
NameBDBM50184807
Synonyms:(R)-1-(4-(4-fluoro-2-methyl-1H-indol-5-yloxy)-5-methylpyrrolo[1,2-f][1,2,4]triazin-6-yloxy)propan-2-ol BMS-540215 | CHEMBL377300
TypeSmall organic molecule
Emp. Form.C19H19FN4O3
Mol. Mass.370.3776
SMILESC[C@@H](O)COc1cn2ncnc(Oc3ccc4[nH]c(C)cc4c3F)c2c1C