Reaction Details
TargetTranscription factor p65
LigandBDBM50372520
Substrate/Competitorn/a
Meas. Tech.ChEMBL_465172 (CHEMBL945842)
IC50 1000±n/a nM
Citation Xie, YDeng, SThomas, CJLiu, YZhang, YQRinderspacher, AHuang, WGong, GWyler, MCayanis, EAulner, NTöbben, UChung, CPampou, SSouthall, NVidovic, DSchürer, SBranden, LDavis, REStaudt, LMInglese, JAustin, CPLandry, DWSmith, DHAuld, DS Identification of N-(quinolin-8-yl)benzenesulfonamides as agents capable of down-regulating NFkappaB activity within two separate high-throughput screens of NFkappaB activation. Bioorg Med Chem Lett18:329-35 (2008) 
 
Transcription factor p65
Name:Transcription factor p65
Type:Enzyme
Mol. Mass.:60211.92
Organism:Homo sapiens (Human)
Description:Q04206
Residue:551
BDBM50372520
NameBDBM50372520
Synonyms:CHEMBL271233
TypeSmall organic molecule
Emp. Form.C17H15N3O5S
Mol. Mass.373.383
SMILESCOc1ccc(c(c1)[N+]([O-])=O)S(=O)(=O)Nc1cccc2ccc(C)nc12