Reaction Details
TargetBeta-secretase 1
LigandBDBM50157439
Substrate/Competitorn/a
Meas. Tech.ChEMBL_465257 (CHEMBL930527)
IC50 8.2±n/a nM
Citation Hamada, YAbdel-Rahman, HYamani, ANguyen, JTStochaj, MHidaka, KKimura, THayashi, YSaito, KIshiura, SKiso, Y BACE1 inhibitors: optimization by replacing the P1' residue with non-acidic moiety. Bioorg Med Chem Lett18:1649-53 (2008) 
 
Beta-secretase 1
Name:Beta-secretase 1
Type:Protein
Mol. Mass.:55755.10
Organism:Homo sapiens (Human)
Description:P56817
Residue:501
BDBM50157439
NameBDBM50157439
Synonyms:3-((2R,3S)-3-((S)-2-((S)-2-((S)-2-amino-3-(2H-tetrazole-5-carboxamido)propanamido)-3-methylbutanamido)-4-methylpentanamido)-2-hydroxy-4-phenylbutanamido)benzoic acid CHEMBL183494
TypeSmall organic molecule
Emp. Form.C33H44N10O8
Mol. Mass.708.7647
SMILESCC(C)C[C@H](NC(=O)[C@@H](NC(=O)[C@@H](N)CNC(=O)c1nnn[nH]1)C(C)C)C(=O)N[C@@H](Cc1ccccc1)[C@@H](O)C(=O)Nc1cccc(c1)C(O)=O