Reaction Details
TargetTyrosine-protein kinase JAK3
LigandBDBM50372597
Substrate/Competitorn/a
Meas. Tech.ChEMBL_465390 (CHEMBL945938)
IC50 0.6±n/a nM
Citation Côté, BBoulet, LBrideau, CClaveau, DEthier, DFrenette, RGagnon, MGiroux, AGuay, JGuiral, SMancini, JMartins, EMassé, FMéthot, NRiendeau, DRubin, JXu, DYu, HDucharme, YFriesen, RW Substituted phenanthrene imidazoles as potent, selective, and orally active mPGES-1 inhibitors. Bioorg Med Chem Lett17:6816-20 (2008) 
 
Tyrosine-protein kinase JAK3
Name:Tyrosine-protein kinase JAK3
Type:Protein
Mol. Mass.:125111.08
Organism:Homo sapiens (Human)
Description:P52333
Residue:1124
BDBM50372597
NameBDBM50372597
Synonyms:CHEMBL272424
TypeSmall organic molecule
Emp. Form.C20H10ClF2N3O
Mol. Mass.381.763
SMILESFc1ccc2c3[nH]c(nc3c3cc[nH]c(=O)c3c2c1)-c1c(F)cccc1Cl