Reaction Details
TargetAngiopoietin-1 receptor
LigandBDBM14949
Substrate/Competitorn/a
Meas. Tech.ChEMBL_465748 (CHEMBL948992)
IC50 2±n/a nM
Citation Deak, HLNewcomb, JRNunes, JJBoucher, CCheng, ACDiMauro, EFEpstein, LFGallant, PHodous, BLHuang, XLee, JHPatel, VFSchneider, STurci, SMZhu, X N-(3-(phenylcarbamoyl)arylpyrimidine)-5-carboxamides as potent and selective inhibitors of Lck: structure, synthesis and SAR. Bioorg Med Chem Lett18:1172-6 (2008) 
 
Angiopoietin-1 receptor
Name:Angiopoietin-1 receptor
Type:Enzyme
Mol. Mass.:125835.70
Organism:Homo sapiens (Human)
Description:Q02763
Residue:1124
BDBM14949
NameBDBM14949
Synonyms:2-aminoquinazoline 5 CHEMBL385937 | JMC511681 Compound 34
TypeSmall organic molecule
Emp. Form.C23H17F3N4O
Mol. Mass.422.4025
SMILESCc1ccc(cc1-c1ccc2nc(N)ncc2c1)C(=O)Nc1cccc(c1)C(F)(F)F