Reaction Details
TargetTyrosine-protein kinase Lck
LigandBDBM50372713
Substrate/Competitorn/a
Meas. Tech.ChEMBL_465744 (CHEMBL948988)
IC50 45±n/a nM
Citation Deak, HLNewcomb, JRNunes, JJBoucher, CCheng, ACDiMauro, EFEpstein, LFGallant, PHodous, BLHuang, XLee, JHPatel, VFSchneider, STurci, SMZhu, X N-(3-(phenylcarbamoyl)arylpyrimidine)-5-carboxamides as potent and selective inhibitors of Lck: structure, synthesis and SAR. Bioorg Med Chem Lett18:1172-6 (2008) 
 
Tyrosine-protein kinase Lck
Name:Tyrosine-protein kinase Lck
Type:n/a
Mol. Mass.:57987.83
Organism:Homo sapiens (Human)
Description:P06239
Residue:509
BDBM50372713
NameBDBM50372713
Synonyms:CHEMBL255132
TypeSmall organic molecule
Emp. Form.C28H33F3N6O3
Mol. Mass.558.5952
SMILESCOc1nc(NCCCCN(C)C)ncc1C(=O)Nc1cc(ccc1C)C(=O)Nc1cccc(c1C)C(F)(F)F