Reaction Details
TargetFarnesyl pyrophosphate synthase
LigandBDBM50372760
Substrate/Competitorn/a
Meas. Tech.ChEMBL_465861 (CHEMBL951084)
IC50>100000±n/a nM
Citation Peukert, SSun, YZhang, RHurley, BSabio, MShen, XGray, CDzink-Fox, JTao, JCebula, RWattanasin, S Design and structure-activity relationships of potent and selective inhibitors of undecaprenyl pyrophosphate synthase (UPPS): tetramic, tetronic acids and dihydropyridin-2-ones. Bioorg Med Chem Lett18:1840-4 (2008) 
 
Farnesyl pyrophosphate synthase
Name:Farnesyl pyrophosphate synthase
Type:Enzyme
Mol. Mass.:48272.89
Organism:Homo sapiens (Human)
Description:P14324
Residue:419
BDBM50372760
NameBDBM50372760
Synonyms:CHEMBL257948
TypeSmall organic molecule
Emp. Form.C25H22N2O3
Mol. Mass.398.4538
SMILESO=C(Nc1ccc(cc1)-c1ccccc1)C1C(=O)NC(CCc2ccccc2)C1=O