Reaction Details
TargetIsoprenyl transferase
LigandBDBM50372769
Substrate/Competitorn/a
Meas. Tech.ChEMBL_465860 (CHEMBL951083)
IC50 8500±n/a nM
Citation Peukert, SSun, YZhang, RHurley, BSabio, MShen, XGray, CDzink-Fox, JTao, JCebula, RWattanasin, S Design and structure-activity relationships of potent and selective inhibitors of undecaprenyl pyrophosphate synthase (UPPS): tetramic, tetronic acids and dihydropyridin-2-ones. Bioorg Med Chem Lett18:1840-4 (2008) 
 
Isoprenyl transferase
Name:Isoprenyl transferase
Type:PROTEIN
Mol. Mass.:28705.02
Organism:Streptococcus pneumoniae
Description:ChEMBL_465860
Residue:252
BDBM50372769
NameBDBM50372769
Synonyms:CHEMBL256017
TypeSmall organic molecule
Emp. Form.C25H22N2O5S
Mol. Mass.462.518
SMILESO=C(Nc1ccc(cc1)S(=O)(=O)c1ccccc1)C1C(=O)CC(Cc2ccccc2)NC1=O