Reaction Details
TargetIsoprenyl transferase
LigandBDBM50372777
Substrate/Competitorn/a
Meas. Tech.ChEMBL_465860 (CHEMBL951083)
IC50 58000±n/a nM
Citation Peukert, SSun, YZhang, RHurley, BSabio, MShen, XGray, CDzink-Fox, JTao, JCebula, RWattanasin, S Design and structure-activity relationships of potent and selective inhibitors of undecaprenyl pyrophosphate synthase (UPPS): tetramic, tetronic acids and dihydropyridin-2-ones. Bioorg Med Chem Lett18:1840-4 (2008) 
 
Isoprenyl transferase
Name:Isoprenyl transferase
Type:PROTEIN
Mol. Mass.:28705.02
Organism:Streptococcus pneumoniae
Description:ChEMBL_465860
Residue:252
BDBM50372777
NameBDBM50372777
Synonyms:CHEMBL272164
TypeSmall organic molecule
Emp. Form.C17H20N2O3
Mol. Mass.300.3523
SMILESO=C(Nc1ccc(cc1)C1CCCCC1)C1C(=O)CNC1=O