Reaction Details
TargetIsoprenyl transferase
LigandBDBM50372780
Substrate/Competitorn/a
Meas. Tech.ChEMBL_465860 (CHEMBL951083)
IC50 200±n/a nM
Citation Peukert, SSun, YZhang, RHurley, BSabio, MShen, XGray, CDzink-Fox, JTao, JCebula, RWattanasin, S Design and structure-activity relationships of potent and selective inhibitors of undecaprenyl pyrophosphate synthase (UPPS): tetramic, tetronic acids and dihydropyridin-2-ones. Bioorg Med Chem Lett18:1840-4 (2008) 
 
Isoprenyl transferase
Name:Isoprenyl transferase
Type:PROTEIN
Mol. Mass.:28705.02
Organism:Streptococcus pneumoniae
Description:ChEMBL_465860
Residue:252
BDBM50372780
NameBDBM50372780
Synonyms:CHEMBL404126
TypeSmall organic molecule
Emp. Form.C22H30N2O3
Mol. Mass.370.4852
SMILESCC(C)CC1CC(=O)C(C(=O)Nc2ccc(cc2)C2CCCCC2)C(=O)N1