Reaction Details
TargetCholinesterase
LigandBDBM10620
Substrate/Competitorn/a
Meas. Tech.ChEMBL_466873 (CHEMBL922713)
IC50 1600±n/a nM
Citation Xie, QWang, HXia, ZLu, MZhang, WWang, XFu, WTang, YSheng, WLi, WZhou, WZhu, XQiu, ZChen, H Bis-(-)-nor-meptazinols as novel nanomolar cholinesterase inhibitors with high inhibitory potency on amyloid-beta aggregation. J Med Chem51:2027-36 (2008) 
 
Cholinesterase
Name:Cholinesterase
Type:Protein
Mol. Mass.:68465.99
Organism:Mus musculus (Mouse)
Description:Q03311
Residue:603
BDBM10620
NameBDBM10620
Synonyms:(S)-3-(1-(dimethylamino)ethyl)phenyl ethyl(methyl)carbamate 3-(1-(dimethylamino)ethyl)phenyl ethyl(methyl)carbamate CHEMBL636 Ethyl-methyl-carbamic acid 3-((R)-1-dimethylamino-ethyl)-phenyl ester Ethyl-methyl-carbamic acid 3-(1-dimethylamino-ethyl)-phenyl ester Rivastigmine SDZ-212-713 | SDZ-ENA-713
TypeSmall organic molecule
Emp. Form.C14H22N2O2
Mol. Mass.250.3367
SMILES[H][C@@](C)(N(C)C)c1cccc(OC(=O)N(C)CC)c1