Reaction Details
Target6-phosphogluconate dehydrogenase, decarboxylating
LigandBDBM50135169
Substrate/Competitorn/a
Meas. Tech.ChEMBL_467396 (CHEMBL921930)
IC50 1280±n/a nM
Citation Shin, ESPark, JShin, JMCho, DCho, SYShin, DWHam, MKim, JBLee, TR Catechin gallates are NADP+-competitive inhibitors of glucose-6-phosphate dehydrogenase and other enzymes that employ NADP+ as a coenzyme. Bioorg Med Chem16:3580-6 (2008) 
 
6-phosphogluconate dehydrogenase, decarboxylating
Name:6-phosphogluconate dehydrogenase, decarboxylating
Type:Protein
Mol. Mass.:53143.42
Organism:Homo sapiens (Human)
Description:P52209
Residue:483
BDBM50135169
NameBDBM50135169
Synonyms:(-)-Catechin gallate 3,4,5-Trihydroxy-benzoic acid (2S,3R)-2-(3,4-dihydroxy-phenyl)-5,7-dihydroxy-chroman-3-yl ester | CHEMBL129451
TypeSmall organic molecule
Emp. Form.C22H18O10
Mol. Mass.442.3723
SMILESOc1cc(O)c2C[C@@H](OC(=O)c3cc(O)c(O)c(O)c3)[C@@H](Oc2c1)c1ccc(O)c(O)c1