Reaction Details
Target6-phosphogluconate dehydrogenase, decarboxylating
LigandBDBM50187665
Substrate/Competitorn/a
Meas. Tech.ChEMBL_467396 (CHEMBL921930)
IC50>1000000±n/a nM
Citation Shin, ESPark, JShin, JMCho, DCho, SYShin, DWHam, MKim, JBLee, TR Catechin gallates are NADP+-competitive inhibitors of glucose-6-phosphate dehydrogenase and other enzymes that employ NADP+ as a coenzyme. Bioorg Med Chem16:3580-6 (2008) 
 
6-phosphogluconate dehydrogenase, decarboxylating
Name:6-phosphogluconate dehydrogenase, decarboxylating
Type:Protein
Mol. Mass.:53143.42
Organism:Homo sapiens (Human)
Description:P52209
Residue:483
BDBM50187665
NameBDBM50187665
Synonyms:(-)-epigallocatechin | CHEMBL47386
TypeSmall organic molecule
Emp. Form.C15H14O7
Mol. Mass.306.2675
SMILESO[C@@H]1Cc2c(O)cc(O)cc2O[C@@H]1c1cc(O)c(O)c(O)c1