Reaction Details
TargetProstaglandin E2 receptor EP2 subtype
LigandBDBM50373944
Substrate/Competitorn/a
Meas. Tech.ChEMBL_468777 (CHEMBL931917)
Ki 21±n/a nM
Citation Xiao, YAraldi, GLZhao, ZReddy, AKarra, SBrugger, NFischer, DPalmer, EBao, BMcKenna, SD Synthesis and evaluation of a gamma-lactam as a highly selective EP2 and EP4 receptor agonist. Bioorg Med Chem Lett18:821-4 (2008) 
 
Prostaglandin E2 receptor EP2 subtype
Name:Prostaglandin E2 receptor EP2 subtype
Type:Enzyme
Mol. Mass.:39775.71
Organism:Homo sapiens (Human)
Description:P43116
Residue:358
BDBM50373944
NameBDBM50373944
Synonyms:CHEMBL272277
TypeSmall organic molecule
Emp. Form.C24H33NO4
Mol. Mass.399.5231
SMILESCCCCC1(CCC1)[C@@H](O)\C=C\[C@H]1CCC(=O)N1CCc1ccc(cc1)C(O)=O