Reaction Details
TargetTyrosine-protein kinase Lck
LigandBDBM50374617
Substrate/Competitorn/a
Meas. Tech.ChEMBL_469608 (CHEMBL934187)
IC50 12±n/a nM
Citation Martin, MWNewcomb, JNunes, JJBoucher, CChai, LEpstein, LFFaust, TFlores, SGallant, PGore, AGu, YHsieh, FHuang, XKim, JLMiddleton, SMorgenstern, KOliveira-dos-Santos, APatel, VFPowers, DRose, PTudor, YTurci, SMWelcher, AAZack, DZhao, HZhu, LZhu, XGhiron, CErmann, MJohnston, DSaluste, CG Structure-based design of novel 2-amino-6-phenyl-pyrimido[5',4':5,6]pyrimido[1,2-a]benzimidazol-5(6H)-ones as potent and orally active inhibitors of lymphocyte specific kinase (Lck): synthesis, SAR, and in vivo anti-inflammatory activity. J Med Chem51:1637-48 (2008) 
 
Tyrosine-protein kinase Lck
Name:Tyrosine-protein kinase Lck
Type:n/a
Mol. Mass.:57987.83
Organism:Homo sapiens (Human)
Description:P06239
Residue:509
BDBM50374617
NameBDBM50374617
Synonyms:CHEMBL405430
TypeSmall organic molecule
Emp. Form.C35H38N8O3
Mol. Mass.618.728
SMILESCOc1cc(Nc2ncc3c(n2)n2c4ccccc4nc2n(-c2c(C)cccc2C)c3=O)ccc1OCCCN1CCN(C)CC1