Reaction Details
TargetTyrosine-protein kinase Lck
LigandBDBM50374618
Substrate/Competitorn/a
Meas. Tech.ChEMBL_469608 (CHEMBL934187)
IC50 12±n/a nM
Citation Martin, MWNewcomb, JNunes, JJBoucher, CChai, LEpstein, LFFaust, TFlores, SGallant, PGore, AGu, YHsieh, FHuang, XKim, JLMiddleton, SMorgenstern, KOliveira-dos-Santos, APatel, VFPowers, DRose, PTudor, YTurci, SMWelcher, AAZack, DZhao, HZhu, LZhu, XGhiron, CErmann, MJohnston, DSaluste, CG Structure-based design of novel 2-amino-6-phenyl-pyrimido[5',4':5,6]pyrimido[1,2-a]benzimidazol-5(6H)-ones as potent and orally active inhibitors of lymphocyte specific kinase (Lck): synthesis, SAR, and in vivo anti-inflammatory activity. J Med Chem51:1637-48 (2008) 
 
Tyrosine-protein kinase Lck
Name:Tyrosine-protein kinase Lck
Type:n/a
Mol. Mass.:57987.83
Organism:Homo sapiens (Human)
Description:P06239
Residue:509
BDBM50374618
NameBDBM50374618
Synonyms:CHEMBL408030
TypeSmall organic molecule
Emp. Form.C34H35N7O2
Mol. Mass.573.6874
SMILESCc1cccc(C)c1-n1c2nc3ccccc3n2c2nc(Nc3ccc(OCCCN4CCCCC4)cc3)ncc2c1=O