Reaction Details
TargetCoagulation factor X
LigandBDBM50374896
Substrate/Competitorn/a
Meas. Tech.ChEMBL_470061 (CHEMBL933439)
Ki 1±n/a nM
Citation Smallheer, JMWang, SLaws, MLNakajima, SHu, ZHan, WJacobson, ILuettgen, JMRossi, KARendina, ARKnabb, RMWexler, RRLam, PYQuan, ML Sulfonamidolactam inhibitors of coagulation factor Xa. Bioorg Med Chem Lett18:2428-33 (2008) 
 
Coagulation factor X
Name:Coagulation factor X
Type:Enzyme
Mol. Mass.:54726.60
Organism:Homo sapiens (Human)
Description:n/a
Residue:488
BDBM50374896
NameBDBM50374896
Synonyms:CHEMBL271427
TypeSmall organic molecule
Emp. Form.C30H26ClFN2O7S2
Mol. Mass.645.118
SMILESCS(=O)(=O)c1ccccc1-c1ccc(N2CCCC(N(CC(O)=O)S(=O)(=O)c3ccc4cc(Cl)ccc4c3)C2=O)c(F)c1