Reaction Details
TargetCoagulation factor X
LigandBDBM50374899
Substrate/Competitorn/a
Meas. Tech.ChEMBL_470061 (CHEMBL933439)
Ki 26±n/a nM
Citation Smallheer, JMWang, SLaws, MLNakajima, SHu, ZHan, WJacobson, ILuettgen, JMRossi, KARendina, ARKnabb, RMWexler, RRLam, PYQuan, ML Sulfonamidolactam inhibitors of coagulation factor Xa. Bioorg Med Chem Lett18:2428-33 (2008) 
 
Coagulation factor X
Name:Coagulation factor X
Type:Enzyme
Mol. Mass.:54726.60
Organism:Homo sapiens (Human)
Description:n/a
Residue:488
BDBM50374899
NameBDBM50374899
Synonyms:CHEMBL272115
TypeSmall organic molecule
Emp. Form.C25H22FN3O6S3
Mol. Mass.575.652
SMILESCS(=O)(=O)c1ccccc1-c1ccc(N2CCCC(NS(=O)(=O)c3ccc(s3)-c3ccon3)C2=O)c(F)c1