Reaction Details
TargetCoagulation factor X
LigandBDBM50374906
Substrate/Competitorn/a
Meas. Tech.ChEMBL_470061 (CHEMBL933439)
Ki 650±n/a nM
Citation Smallheer, JMWang, SLaws, MLNakajima, SHu, ZHan, WJacobson, ILuettgen, JMRossi, KARendina, ARKnabb, RMWexler, RRLam, PYQuan, ML Sulfonamidolactam inhibitors of coagulation factor Xa. Bioorg Med Chem Lett18:2428-33 (2008) 
 
Coagulation factor X
Name:Coagulation factor X
Type:Enzyme
Mol. Mass.:54726.60
Organism:Homo sapiens (Human)
Description:n/a
Residue:488
BDBM50374906
NameBDBM50374906
Synonyms:CHEMBL402730
TypeSmall organic molecule
Emp. Form.C24H21Cl2FN2O5S2
Mol. Mass.571.468
SMILESCS(=O)(=O)c1ccccc1-c1ccc(N2CCCC(NS(=O)(=O)c3cc(Cl)ccc3Cl)C2=O)c(F)c1