Reaction Details
TargetCoagulation factor X
LigandBDBM50374908
Substrate/Competitorn/a
Meas. Tech.ChEMBL_470061 (CHEMBL933439)
Ki 100±n/a nM
Citation Smallheer, JMWang, SLaws, MLNakajima, SHu, ZHan, WJacobson, ILuettgen, JMRossi, KARendina, ARKnabb, RMWexler, RRLam, PYQuan, ML Sulfonamidolactam inhibitors of coagulation factor Xa. Bioorg Med Chem Lett18:2428-33 (2008) 
 
Coagulation factor X
Name:Coagulation factor X
Type:Enzyme
Mol. Mass.:54726.60
Organism:Homo sapiens (Human)
Description:n/a
Residue:488
BDBM50374908
NameBDBM50374908
Synonyms:CHEMBL257240
TypeSmall organic molecule
Emp. Form.C25H25FN2O6S2
Mol. Mass.532.604
SMILESCOc1cccc(c1)S(=O)(=O)NC1CCCN(C1=O)c1ccc(cc1F)-c1ccccc1S(C)(=O)=O