Reaction Details
TargetMast/stem cell growth factor receptor Kit
LigandBDBM27889
Substrate/Competitorn/a
Meas. Tech.ChEMBL_470268 (CHEMBL951154)
IC50 56±n/a nM
Citation Huang, HHutta, DAHu, HDesJarlais, RLSchubert, CPetrounia, IPChaikin, MAManthey, CLPlayer, MR Design and synthesis of a pyrido[2,3-d]pyrimidin-5-one class of anti-inflammatory FMS inhibitors. Bioorg Med Chem Lett18:2355-61 (2008) 
 
Mast/stem cell growth factor receptor Kit
Name:Mast/stem cell growth factor receptor Kit
Type:Protein
Mol. Mass.:109869.37
Organism:Homo sapiens (Human)
Description:P10721
Residue:976
BDBM27889
NameBDBM27889
Synonyms:8-(2,3-dihydro-1H-inden-5-yl)-2-{[4-(4-methylpiperazin-1-yl)phenyl]amino}-5-oxo-5H,8H-pyrido[2,3-d]pyrimidine-6-carboxamide | Pyrido[2,3-d]pyrimidin-5-one, 10
TypeSmall organic molecule
Emp. Form.C28H29N7O2
Mol. Mass.495.5756
SMILESCN1CCN(CC1)c1ccc(Nc2ncc3c(n2)n(cc(C(N)=O)c3=O)-c2ccc3CCCc3c2)cc1