Reaction Details
TargetGeranylgeranyl pyrophosphate synthase BTS1
LigandBDBM25284
Substrate/Competitorn/a
Meas. Tech.ChEMBL_474165 (CHEMBL938423)
IC50 200±n/a nM
Citation Guo, RTCao, RLiang, PHKo, TPChang, THHudock, MPJeng, WYChen, CKZhang, YSong, YKuo, CJYin, FOldfield, EWang, AH Bisphosphonates target multiple sites in both cis- and trans-prenyltransferases. Proc Natl Acad Sci U S A104:10022-7 (2007) 
 
Geranylgeranyl pyrophosphate synthase BTS1
Name:Geranylgeranyl pyrophosphate synthase BTS1
Type:Protein
Mol. Mass.:38647.44
Organism:Saccharomyces cerevisiae (Yeast)
Description:n/a
Residue:335
BDBM25284
NameBDBM25284
Synonyms:(1-hydroxy-2-{3-[3-(naphthalene-2-sulfonamido)phenyl]phenyl}-1-phosphonoethyl)phosphonic acid bisphosphonate, 6
TypeSmall organic molecule
Emp. Form.C24H23NO9P2S
Mol. Mass.563.453
SMILESOC(Cc1cccc(c1)-c1cccc(NS(=O)(=O)c2ccc3ccccc3c2)c1)(P(O)(O)=O)P(O)(O)=O