Reaction Details
TargetGeranylgeranyl pyrophosphate synthase
LigandBDBM25288
Substrate/Competitorn/a
Meas. Tech.ChEMBL_474168 (CHEMBL938426)
Ki 110±n/a nM
Citation Guo, RTCao, RLiang, PHKo, TPChang, THHudock, MPJeng, WYChen, CKZhang, YSong, YKuo, CJYin, FOldfield, EWang, AH Bisphosphonates target multiple sites in both cis- and trans-prenyltransferases. Proc Natl Acad Sci U S A104:10022-7 (2007) 
 
Geranylgeranyl pyrophosphate synthase
Name:Geranylgeranyl pyrophosphate synthase
Type:Homooctamer; transferase
Mol. Mass.:34867.94
Organism:Homo sapiens (Human)
Description:Recombinant human GGPPS was cloned and expressed in E. coli.
Residue:300
BDBM25288
NameBDBM25288
Synonyms:BPH-629 bisphosphonate, 8
TypeSmall organic molecule
Emp. Form.C20H18O8P2
Mol. Mass.448.2996
SMILESOC(Cc1cccc(c1)-c1cccc2c1oc1ccccc21)(P(O)(O)=O)P(O)(O)=O