Reaction Details
TargetGeranylgeranyl pyrophosphate synthase
LigandBDBM25297
Substrate/Competitorn/a
Meas. Tech.ChEMBL_474168 (CHEMBL938426)
Ki 230±n/a nM
Citation Guo, RTCao, RLiang, PHKo, TPChang, THHudock, MPJeng, WYChen, CKZhang, YSong, YKuo, CJYin, FOldfield, EWang, AH Bisphosphonates target multiple sites in both cis- and trans-prenyltransferases. Proc Natl Acad Sci U S A104:10022-7 (2007) 
 
Geranylgeranyl pyrophosphate synthase
Name:Geranylgeranyl pyrophosphate synthase
Type:Homooctamer; transferase
Mol. Mass.:34867.94
Organism:Homo sapiens (Human)
Description:Recombinant human GGPPS was cloned and expressed in E. coli.
Residue:300
BDBM25297
NameBDBM25297
Synonyms:1-(2-hydrogen phosphonato-2-hydroxy-2-phosphonoethyl)-3-(3-phenylphenyl)pyridin-1-ium bisphosphonate, 7
TypeSmall organic molecule
Emp. Form.C19H19NO7P2
Mol. Mass.435.3042
SMILESOC(C[n+]1cccc(c1)-c1cccc(c1)-c1ccccc1)(P(O)(O)=O)P(O)([O-])=O