Reaction Details
TargetVascular endothelial growth factor receptor 2
LigandBDBM50375994
Substrate/Competitorn/a
Meas. Tech.ChEMBL_474787 (CHEMBL951280)
IC50 22±n/a nM
Citation Weiss, MMHarmange, JCPolverino, AJBauer, DBerry, LBerry, VBorg, GBready, JChen, DChoquette, DCoxon, ADeMelfi, TDoerr, NEstrada, JFlynn, JGraceffa, RFHarriman, SPKaufman, SLa, DSLong, ANeervannan, SPatel, VFPotashman, MRegal, KRoveto, PMSchrag, MLStarnes, CTasker, ATeffera, YWhittington, DAZanon, R Evaluation of a series of naphthamides as potent, orally active vascular endothelial growth factor receptor-2 tyrosine kinase inhibitors. J Med Chem51:1668-80 (2008) 
 
Vascular endothelial growth factor receptor 2
Name:Vascular endothelial growth factor receptor 2
Type:Receptor Tyrosine Kinase
Mol. Mass.:151510.97
Organism:Homo sapiens (Human)
Description:P35968
Residue:1356
BDBM50375994
NameBDBM50375994
Synonyms:CHEMBL260531
TypeSmall organic molecule
Emp. Form.C25H23N3O5
Mol. Mass.445.4672
SMILESCOCCNC(=O)c1cccc2cc(Oc3ccnc4cc(OC)c(cc34)C(N)=O)ccc12