Reaction Details
TargetVascular endothelial growth factor receptor 2
LigandBDBM50375996
Substrate/Competitorn/a
Meas. Tech.ChEMBL_474787 (CHEMBL951280)
IC50 0.370000±n/a nM
Citation Weiss, MMHarmange, JCPolverino, AJBauer, DBerry, LBerry, VBorg, GBready, JChen, DChoquette, DCoxon, ADeMelfi, TDoerr, NEstrada, JFlynn, JGraceffa, RFHarriman, SPKaufman, SLa, DSLong, ANeervannan, SPatel, VFPotashman, MRegal, KRoveto, PMSchrag, MLStarnes, CTasker, ATeffera, YWhittington, DAZanon, R Evaluation of a series of naphthamides as potent, orally active vascular endothelial growth factor receptor-2 tyrosine kinase inhibitors. J Med Chem51:1668-80 (2008) 
 
Vascular endothelial growth factor receptor 2
Name:Vascular endothelial growth factor receptor 2
Type:Receptor Tyrosine Kinase
Mol. Mass.:151510.97
Organism:Homo sapiens (Human)
Description:P35968
Residue:1356
BDBM50375996
NameBDBM50375996
Synonyms:CHEMBL272250
TypeSmall organic molecule
Emp. Form.C25H21N3O4
Mol. Mass.427.4519
SMILESCOc1cc2nccc(Oc3ccc4c(cccc4c3)C(=O)NC3CC3)c2cc1C(N)=O