Reaction Details
TargetTyrosine-protein kinase Lck
LigandBDBM50376011
Substrate/Competitorn/a
Meas. Tech.ChEMBL_474790 (CHEMBL951283)
IC50 700±n/a nM
Citation Weiss, MMHarmange, JCPolverino, AJBauer, DBerry, LBerry, VBorg, GBready, JChen, DChoquette, DCoxon, ADeMelfi, TDoerr, NEstrada, JFlynn, JGraceffa, RFHarriman, SPKaufman, SLa, DSLong, ANeervannan, SPatel, VFPotashman, MRegal, KRoveto, PMSchrag, MLStarnes, CTasker, ATeffera, YWhittington, DAZanon, R Evaluation of a series of naphthamides as potent, orally active vascular endothelial growth factor receptor-2 tyrosine kinase inhibitors. J Med Chem51:1668-80 (2008) 
 
Tyrosine-protein kinase Lck
Name:Tyrosine-protein kinase Lck
Type:n/a
Mol. Mass.:57987.83
Organism:Homo sapiens (Human)
Description:P06239
Residue:509
BDBM50376011
NameBDBM50376011
Synonyms:CHEMBL270754
TypeSmall organic molecule
Emp. Form.C23H20N2O4
Mol. Mass.388.4159
SMILESCNC(=O)c1cccc2cc(Oc3ccnc4cc(OC)c(OC)cc34)ccc12