Reaction Details
TargetTyrosine-protein kinase Lck
LigandBDBM50375993
Substrate/Competitorn/a
Meas. Tech.ChEMBL_474790 (CHEMBL951283)
IC50 1000±n/a nM
Citation Weiss, MMHarmange, JCPolverino, AJBauer, DBerry, LBerry, VBorg, GBready, JChen, DChoquette, DCoxon, ADeMelfi, TDoerr, NEstrada, JFlynn, JGraceffa, RFHarriman, SPKaufman, SLa, DSLong, ANeervannan, SPatel, VFPotashman, MRegal, KRoveto, PMSchrag, MLStarnes, CTasker, ATeffera, YWhittington, DAZanon, R Evaluation of a series of naphthamides as potent, orally active vascular endothelial growth factor receptor-2 tyrosine kinase inhibitors. J Med Chem51:1668-80 (2008) 
 
Tyrosine-protein kinase Lck
Name:Tyrosine-protein kinase Lck
Type:n/a
Mol. Mass.:57987.83
Organism:Homo sapiens (Human)
Description:P06239
Residue:509
BDBM50375993
NameBDBM50375993
Synonyms:CHEMBL259252
TypeSmall organic molecule
Emp. Form.C26H24N2O4
Mol. Mass.428.4798
SMILESCOc1cc2nccc(Oc3ccc4c(cccc4c3)C(=O)NC3CCC3)c2cc1OC