Reaction Details
TargetTyrosine-protein kinase Lyn
LigandBDBM50376003
Substrate/Competitorn/a
Meas. Tech.ChEMBL_474823 (CHEMBL950240)
IC50 88±n/a nM
Citation Weiss, MMHarmange, JCPolverino, AJBauer, DBerry, LBerry, VBorg, GBready, JChen, DChoquette, DCoxon, ADeMelfi, TDoerr, NEstrada, JFlynn, JGraceffa, RFHarriman, SPKaufman, SLa, DSLong, ANeervannan, SPatel, VFPotashman, MRegal, KRoveto, PMSchrag, MLStarnes, CTasker, ATeffera, YWhittington, DAZanon, R Evaluation of a series of naphthamides as potent, orally active vascular endothelial growth factor receptor-2 tyrosine kinase inhibitors. J Med Chem51:1668-80 (2008) 
 
Tyrosine-protein kinase Lyn
Name:Tyrosine-protein kinase Lyn
Type:Protein
Mol. Mass.:58575.92
Organism:Homo sapiens (Human)
Description:P07948
Residue:512
BDBM50376003
NameBDBM50376003
Synonyms:CHEMBL271984
TypeSmall organic molecule
Emp. Form.C22H18N2O4
Mol. Mass.374.3893
SMILESCOc1cc2nccc(Oc3ccc4c(cccc4c3)C(N)=O)c2cc1OC