Reaction Details
TargetAngiopoietin-1 receptor
LigandBDBM50376000
Substrate/Competitorn/a
Meas. Tech.ChEMBL_474788 (CHEMBL951281)
IC50 8300±n/a nM
Citation Weiss, MMHarmange, JCPolverino, AJBauer, DBerry, LBerry, VBorg, GBready, JChen, DChoquette, DCoxon, ADeMelfi, TDoerr, NEstrada, JFlynn, JGraceffa, RFHarriman, SPKaufman, SLa, DSLong, ANeervannan, SPatel, VFPotashman, MRegal, KRoveto, PMSchrag, MLStarnes, CTasker, ATeffera, YWhittington, DAZanon, R Evaluation of a series of naphthamides as potent, orally active vascular endothelial growth factor receptor-2 tyrosine kinase inhibitors. J Med Chem51:1668-80 (2008) 
 
Angiopoietin-1 receptor
Name:Angiopoietin-1 receptor
Type:Enzyme
Mol. Mass.:125835.70
Organism:Homo sapiens (Human)
Description:Q02763
Residue:1124
BDBM50376000
NameBDBM50376000
Synonyms:CHEMBL270556
TypeSmall organic molecule
Emp. Form.C21H17N3O4
Mol. Mass.375.3774
SMILESCOc1cc2ncnc(Oc3ccc4c(cccc4c3)C(N)=O)c2cc1OC