Reaction Details
TargetVascular endothelial growth factor receptor 2
LigandBDBM50376029
Substrate/Competitorn/a
Meas. Tech.ChEMBL_474871 (CHEMBL932834)
IC50 1±n/a nM
Citation Harmange, JCWeiss, MMGermain, JPolverino, AJBorg, GBready, JChen, DChoquette, DCoxon, ADeMelfi, TDiPietro, LDoerr, NEstrada, JFlynn, JGraceffa, RFHarriman, SPKaufman, SLa, DSLong, AMartin, MWNeervannan, SPatel, VFPotashman, MRegal, KRoveto, PMSchrag, MLStarnes, CTasker, ATeffera, YWang, LWhite, RDWhittington, DAZanon, R Naphthamides as novel and potent vascular endothelial growth factor receptor tyrosine kinase inhibitors: design, synthesis, and evaluation. J Med Chem51:1649-67 (2008) 
 
Vascular endothelial growth factor receptor 2
Name:Vascular endothelial growth factor receptor 2
Type:Receptor Tyrosine Kinase
Mol. Mass.:151510.97
Organism:Homo sapiens (Human)
Description:P35968
Residue:1356
BDBM50376029
NameBDBM50376029
Synonyms:CHEMBL269914
TypeSmall organic molecule
Emp. Form.C29H20ClF3N2O4
Mol. Mass.552.928
SMILESCOc1cc2nccc(Oc3ccc4c(cccc4c3)C(=O)Nc3ccc(Cl)c(c3)C(F)(F)F)c2cc1OC