Reaction Details
TargetVascular endothelial growth factor receptor 2
LigandBDBM50376046
Substrate/Competitorn/a
Meas. Tech.ChEMBL_474871 (CHEMBL932834)
IC50 28±n/a nM
Citation Harmange, JCWeiss, MMGermain, JPolverino, AJBorg, GBready, JChen, DChoquette, DCoxon, ADeMelfi, TDiPietro, LDoerr, NEstrada, JFlynn, JGraceffa, RFHarriman, SPKaufman, SLa, DSLong, AMartin, MWNeervannan, SPatel, VFPotashman, MRegal, KRoveto, PMSchrag, MLStarnes, CTasker, ATeffera, YWang, LWhite, RDWhittington, DAZanon, R Naphthamides as novel and potent vascular endothelial growth factor receptor tyrosine kinase inhibitors: design, synthesis, and evaluation. J Med Chem51:1649-67 (2008) 
 
Vascular endothelial growth factor receptor 2
Name:Vascular endothelial growth factor receptor 2
Type:Receptor Tyrosine Kinase
Mol. Mass.:151510.97
Organism:Homo sapiens (Human)
Description:P35968
Residue:1356
BDBM50376046
NameBDBM50376046
Synonyms:CHEMBL410093
TypeSmall organic molecule
Emp. Form.C23H15ClN4O2
Mol. Mass.414.844
SMILESClc1ccc(NC(=O)c2cccc3cc(Oc4ncnc5[nH]ccc45)ccc23)cc1