Reaction Details
TargetAndrogen receptor
LigandBDBM50376214
Substrate/Competitorn/a
Meas. Tech.ChEMBL_475674 (CHEMBL937560)
IC50 250±n/a nM
Citation Bisson, WHCheltsov, AVBruey-Sedano, NLin, BChen, JGoldberger, NMay, LTChristopoulos, ADalton, JTSexton, PMZhang, XKAbagyan, R Discovery of antiandrogen activity of nonsteroidal scaffolds of marketed drugs. Proc Natl Acad Sci U S A104:11927-32 (2007) 
 
Androgen receptor
Name:Androgen receptor
Type:Receptor
Mol. Mass.:99185.27
Organism:Homo sapiens (Human)
Description:CHO cells were stably transfected with human AR gene.
Residue:920
BDBM50376214
NameBDBM50376214
Synonyms:CHEMBL263660
TypeSmall organic molecule
Emp. Form.C25H16F3NOS
Mol. Mass.435.461
SMILESFC(F)(F)c1ccc2Sc3ccccc3N(CC(=O)c3cccc4ccccc34)c2c1