Reaction Details
TargetMitogen-activated protein kinase 14
LigandBDBM50376432
Substrate/Competitorn/a
Meas. Tech.ChEMBL_476693 (CHEMBL933483)
Ki 0.98±n/a nM
Citation Wrobleski, STLin, SHynes, JWu, HPitt, SShen, DRZhang, RGillooly, KMShuster, DJMcIntyre, KWDoweyko, AMKish, KFTredup, JADuke, GJSack, JSMcKinnon, MDodd, JBarrish, JCSchieven, GLLeftheris, K Synthesis and SAR of new pyrrolo[2,1-f][1,2,4]triazines as potent p38 alpha MAP kinase inhibitors. Bioorg Med Chem Lett18:2739-44 (2008) 
 
Mitogen-activated protein kinase 14
Name:Mitogen-activated protein kinase 14
Type:Serine/threonine-protein kinase
Mol. Mass.:41286.76
Organism:Homo sapiens (Human)
Description:Q16539
Residue:360
BDBM50376432
NameBDBM50376432
Synonyms:CHEMBL258748
TypeSmall organic molecule
Emp. Form.C28H31N7O3
Mol. Mass.513.5908
SMILESCCNC(=O)c1cn2ncnc(Nc3cc(NC(=O)c4cccc(c4)N4CCOCC4)ccc3C)c2c1C