Reaction Details
TargetMitogen-activated protein kinase 14
LigandBDBM50376433
Substrate/Competitorn/a
Meas. Tech.ChEMBL_476693 (CHEMBL933483)
Ki 0.44±n/a nM
Citation Wrobleski, STLin, SHynes, JWu, HPitt, SShen, DRZhang, RGillooly, KMShuster, DJMcIntyre, KWDoweyko, AMKish, KFTredup, JADuke, GJSack, JSMcKinnon, MDodd, JBarrish, JCSchieven, GLLeftheris, K Synthesis and SAR of new pyrrolo[2,1-f][1,2,4]triazines as potent p38 alpha MAP kinase inhibitors. Bioorg Med Chem Lett18:2739-44 (2008) 
 
Mitogen-activated protein kinase 14
Name:Mitogen-activated protein kinase 14
Type:Serine/threonine-protein kinase
Mol. Mass.:41286.76
Organism:Homo sapiens (Human)
Description:Q16539
Residue:360
BDBM50376433
NameBDBM50376433
Synonyms:CHEMBL258895
TypeSmall organic molecule
Emp. Form.C33H34N8O3
Mol. Mass.590.6749
SMILESC[C@H](NC(=O)c1cn2ncnc(Nc3cc(NC(=O)c4ccnc(c4)N4CCOCC4)ccc3C)c2c1C)c1ccccc1