Reaction Details
TargetMu-type opioid receptor
LigandBDBM50376845
Substrate/Competitorn/a
Meas. Tech.ChEMBL_477925 (CHEMBL923550)
Ki 3.1±n/a nM
Citation Tidgewell, KGroer, CEHarding, WWLozama, ASchmidt, MMarquam, AHiemstra, JPartilla, JSDersch, CMRothman, RBBohn, LMPrisinzano, TE Herkinorin analogues with differential beta-arrestin-2 interactions. J Med Chem51:2421-31 (2008) 
 
Mu-type opioid receptor
Name:Mu-type opioid receptor
Type:G Protein-Coupled Receptor (GPCR)
Mol. Mass.:44789.51
Organism:Homo sapiens (Human)
Description:P35372
Residue:400
BDBM50376845
NameBDBM50376845
Synonyms:CHEMBL259658
TypeSmall organic molecule
Emp. Form.C28H31NO7
Mol. Mass.493.5482
SMILESCOC(=O)[C@@H]1C[C@H](NC(=O)c2ccccc2)C(=O)[C@H]2[C@@]1(C)CC[C@H]1C(=O)O[C@@H](C[C@]21C)c1ccoc1