Reaction Details
TargetDelta-type opioid receptor
LigandBDBM50376836
Substrate/Competitorn/a
Meas. Tech.ChEMBL_477926 (CHEMBL923551)
Ki>10000±n/a nM
Citation Tidgewell, KGroer, CEHarding, WWLozama, ASchmidt, MMarquam, AHiemstra, JPartilla, JSDersch, CMRothman, RBBohn, LMPrisinzano, TE Herkinorin analogues with differential beta-arrestin-2 interactions. J Med Chem51:2421-31 (2008) 
 
Delta-type opioid receptor
Name:Delta-type opioid receptor
Type:G Protein-Coupled Receptor (GPCR)
Mol. Mass.:40382.98
Organism:Homo sapiens (Human)
Description:Competition binding assays were carried out using membrane preparations from transfected HN9.10 cells that constitutively expressed the delta opioid receptor.
Residue:372
BDBM50376836
NameBDBM50376836
Synonyms:CHEMBL408900
TypeSmall organic molecule
Emp. Form.C32H32O8
Mol. Mass.544.5917
SMILESCOC(=O)[C@@H]1C[C@H](OC(=O)c2cccc3ccccc23)C(=O)[C@H]2[C@@]1(C)CC[C@H]1C(=O)O[C@@H](C[C@]21C)c1ccoc1